BDBM50486236 CHEBI:39170::NITENPYRAM
SMILES CCN(Cc1ccc(Cl)nc1)C(\NC)=C\[N+]([O-])=O
InChI Key InChIKey=CFRPSFYHXJZSBI-DHZHZOJOSA-N
Data  3 IC50
  Tab Delimited (TSV)   2D SDfile   Computed 3D by Vconf -m prep SDfile
Find this compound or compounds like it in BindingDB:
Activity Spreadsheet -- Enzyme Inhibition Constant Data from BindingDB
Found 3 hits for monomerid = 50486236
TargetPolyphenol oxidase 2(Agaricus bisporus (Common mushroom))
University Of California
Curated by ChEMBL
LigandPNGBDBM50486236(CHEBI:39170 | NITENPYRAM)
Affinity DataIC50: >1.00E+6nM. Assay description: Inhibition of Agaricus bisporus (mushroom) tyrosinase
In DepthDetails ArticlePubMed
TargetAcetylcholine receptor subunit beta-like 2(Drosophila melanogaster)
University Of California
Curated by ChEMBL
LigandPNGBDBM50486236(CHEBI:39170 | NITENPYRAM)
Affinity DataIC50:  11nM. Assay description: Displacement of [3H]IMI from nicotinic acetylcholine receptor in Drosophila melanogaster head membrane after 90 min by filter binding assay
In DepthDetails ArticlePubMed
TargetAldehyde oxidase 1(Oryctolagus cuniculus)
University Of California
Curated by ChEMBL
LigandPNGBDBM50486236(CHEBI:39170 | NITENPYRAM)
Affinity DataIC50: >1.00E+6nM. Assay description: Inhibition of Oryctolagus cuniculus (rabbit) AOX in liver cytosol
In DepthDetails ArticlePubMed