BDBM50486898 Broussonol E::CHEBI:66727
SMILES [#6]\[#6](-[#6])=[#6]/[#6]-c1cc(cc(-[#8])c1-[#8])-c1oc2cc(-[#8])c(-[#6]\[#6]=[#6](\[#6])-[#6])c(-[#8])c2c(=O)c1-[#8]
InChI Key InChIKey=NQBROFAEMRVICP-UHFFFAOYSA-N
Data  1 KI  2 IC50
  Tab Delimited (TSV)   2D SDfile   Computed 3D by Vconf -m prep SDfile
Find this compound or compounds like it in BindingDB:
Activity Spreadsheet -- Enzyme Inhibition Constant Data from BindingDB
Found 3 hits for monomerid = 50486898
TargetMaltase-glucoamylase(Homo sapiens (Human))
Shiv Nadar University
Curated by ChEMBL
LigandPNGBDBM50486898(Broussonol E | CHEBI:66727)
Affinity DataKi:  2.30E+3nM. Assay description: Mixed type inhibition of alpha-glucosidase (unknown origin) using p-nitrophenyl-alpha-D glucopyranoside as substrate incubated for 30 mins by Linewea...
In DepthDetails ArticlePubMed
TargetTissue alpha-L-fucosidase(Bos taurus)
Shiv Nadar University
Curated by ChEMBL
LigandPNGBDBM50486898(Broussonol E | CHEBI:66727)
Affinity DataIC50:  8.90E+4nM. Assay description: Inhibition of bovine kidney alpha-fucosidase using PNPG as substrate incubated for 10 mins by spectrophotometric method
In DepthDetails ArticlePubMed
TargetAlpha-glucosidase MAL62(Saccharomyces cerevisiae)TBA
LigandPNGBDBM50486898(Broussonol E | CHEBI:66727)
Affinity DataIC50:  2.10E+9nM. Assay description: Inhibition of baker's yeast alpha-glucosidase using p-nitrophenyl-alpha-D-glucopyranoside as substrate by spectrophotometry
In DepthDetails Article