BDBM50487038 CHEMBL2253249
SMILES COc1cc(OC)nc(Oc2cccc3c(C)nn(Cc4cc(C)ccc4[N+]([O-])=O)c(=O)c23)n1
InChI Key InChIKey=KQGJEYMOMZSXSP-UHFFFAOYSA-N
Data  1 KI
  Tab Delimited (TSV)   2D SDfile   Computed 3D by Vconf -m prep SDfile
Find this compound or compounds like it in BindingDB:
Activity Spreadsheet -- Enzyme Inhibition Constant Data from BindingDB
Found 1 hit for monomerid = 50487038
TargetAcetolactate synthase, chloroplastic(Arabidopsis thaliana)
Central China Normal University
Curated by ChEMBL
LigandPNGBDBM50487038(CHEMBL2253249)
Affinity DataKi:  3.10E+5nM. Assay description: Inhibition of wild type Arabidopsis thaliana acetohydroxyacid synthase
Ligand InfoPC cidPC sid
In DepthDetails ArticlePubMed