BDBM50487040 PYRIMINOBAC-METHYL
SMILES CO\N=C(\C)c1cccc(Oc2nc(OC)cc(OC)n2)c1C(=O)OC
InChI Key InChIKey=USSIUIGPBLPCDF-JMIUGGIZSA-N
Data  1 KI
  Tab Delimited (TSV)   2D SDfile   Computed 3D by Vconf -m prep SDfile
Find this compound or compounds like it in BindingDB:
Activity Spreadsheet -- Enzyme Inhibition Constant Data from BindingDB
Found 1 hit for monomerid = 50487040
TargetAcetolactate synthase, chloroplastic(Arabidopsis thaliana)
Central China Normal University
Curated by ChEMBL
LigandPNGBDBM50487040(PYRIMINOBAC-METHYL)
Affinity DataKi:  4.90E+4nM. Assay description: Inhibition of wild type Arabidopsis thaliana acetohydroxyacid synthase
In DepthDetails ArticlePubMed