BDBM50487246 CHEMBL2252847
SMILES CCOP(=O)(OCC)SCCCN1C(=O)c2ccccc2C1=O
InChI Key InChIKey=QBOYFUNEVAOEDI-UHFFFAOYSA-N
Data  2 IC50
  Tab Delimited (TSV)   2D SDfile   Computed 3D by Vconf -m prep SDfile
Find this compound or compounds like it in BindingDB:
Activity Spreadsheet -- Enzyme Inhibition Constant Data from BindingDB
Found 2 hits for monomerid = 50487246
TargetCarboxylic ester hydrolase(Musca domestica)
Chinese Academy Of Agricultural Sciences
Curated by ChEMBL
LigandPNGBDBM50487246(CHEMBL2252847)
Affinity DataIC50:  1.55E+5nM. Assay description: Inhibition of acetylcholinesterase in Musca domestica (house fly) brain by Ellman's method
Ligand InfoPC cidPC sid
In DepthDetails ArticlePubMed
TargetAcetylcholinesterase(Drosophila melanogaster)
Chinese Academy Of Agricultural Sciences
Curated by ChEMBL
LigandPNGBDBM50487246(CHEMBL2252847)
Affinity DataIC50:  8.29E+3nM. Assay description: Inhibition of acetylcholinesterase in Drosophila melanogaster brain by Ellman's method
Ligand InfoPC cidPC sid
In DepthDetails ArticlePubMed