BDBM50489026 CHEMBL1229820
SMILES COc1cc2CCN3C[C@@H]([C@@H](N)C[C@H]3c2cc1OC)c1cccc(CF)c1
InChI Key InChIKey=OQMKJZHTWPQABR-AABGKKOBSA-N
Data  1 IC50
PDB links: 1 PDB ID matches this monomer.
  Tab Delimited (TSV)   2D SDfile   Computed 3D by Vconf -m prep SDfile
Find this compound or compounds like it in BindingDB:
Activity Spreadsheet -- Enzyme Inhibition Constant Data from BindingDB
Found 1 hit for monomerid = 50489026
TargetDipeptidyl peptidase 4(Homo sapiens (Human))TBA
LigandPNGBDBM50489026(CHEMBL1229820)
Affinity DataIC50:  0.5nM. Assay description: Inhibition of dipeptidyl peptidase 4 (unknown origin)
Ligand InfoPC cidPC sidPDB