BDBM50489045 CHEMBL2299193
SMILES COc1ccc(cc1)-c1cc2ccccc2c(=S)o1
InChI Key InChIKey=XYTKNWYWECMBKN-UHFFFAOYSA-N
Data  1 IC50
  Tab Delimited (TSV)   2D SDfile   Computed 3D by Vconf -m prep SDfile
Find this compound or compounds like it in BindingDB:
Activity Spreadsheet -- Enzyme Inhibition Constant Data from BindingDB
Found 1 hit for monomerid = 50489045
TargetLactoperoxidase(Bos taurus (Bovine))TBA
LigandPNGBDBM50489045(CHEMBL2299193)
Affinity DataIC50:  8.40E+3nM. Assay description: Inhibition of Bos taurus (bovine) milk lactoperoxidase-catalyzed iodination of L-tyrosine substrate by reverse phase HPLC analysis
Ligand InfoPC cidPC sid
In DepthDetails Article