BDBM50490809 R-(+)-MARMIN-6'-CIS-VACCENOATE::R-(+)-Marmin-6''-cis-vaccenoate
SMILES CCCCCC\C=C/CCCCCCCCCC(=O)O[C@H](CC\C(C)=C\COc1ccc2ccc(=O)oc2c1)C(C)(C)O
InChI Key InChIKey=RGIBFXLLLNMYOY-YZLPGLLOSA-N
Data  2 IC50
  Tab Delimited (TSV)   2D SDfile   Computed 3D by Vconf -m prep SDfile
Find this compound or compounds like it in BindingDB:
Activity Spreadsheet -- Enzyme Inhibition Constant Data from BindingDB
Found 2 hits for monomerid = 50490809
TargetNADH dehydrogenase [ubiquinone] 1 beta subcomplex subunit 9(Homo sapiens)
University Of Mississippi
Curated by ChEMBL
LigandPNGBDBM50490809(R-(+)-MARMIN-6'-CIS-VACCENOATE | R-(+)-Marmin-6''-...)
Affinity DataIC50: >3.00E+4nM. Assay description: Inhibition of mitochondrial ETC complex 1 in human T47D cells assessed as inhibition of 1% O2-induced HIF1 activation incubated for 30 mins prior to ...
Ligand InfoPC cidPC sid
In DepthDetails ArticlePubMed
TargetMitochondrial complex I (NADH dehydrogenase)(Homo sapiens)
University Of Mississippi
Curated by ChEMBL
LigandPNGBDBM50490809(R-(+)-MARMIN-6'-CIS-VACCENOATE | R-(+)-Marmin-6''-...)
Affinity DataIC50: >3.00E+4nM. Assay description: Inhibition of mitochondrial ETC complex 1 in human T47D cells assessed as inhibition of 1,10-phenanthroline-induced HIF1 activation incubated for 30 ...
Ligand InfoPC cidPC sid
In DepthDetails ArticlePubMed