BDBM50490886 CHEMBL2347728
SMILES CCOc1ccccc1-c1ccc2nc(NC(=O)NCCCO)sc2c1
InChI Key InChIKey=FSILAVJWZRLDRJ-UHFFFAOYSA-N
Data  1 IC50
  Tab Delimited (TSV)   2D SDfile   Computed 3D by Vconf -m prep SDfile
Find this compound or compounds like it in BindingDB:
Activity Spreadsheet -- Enzyme Inhibition Constant Data from BindingDB
Found 1 hit for monomerid = 50490886
TargetTyrosine-protein kinase ABL1(Homo sapiens (Human))
Korea Institute Of Science And Technology (Kaist)
Curated by ChEMBL
LigandPNGBDBM50490886(CHEMBL2347728)
Affinity DataIC50:  0.130nM. Assay description: Inhibition of breakpoint cluster region-Abelson tyrosine kinase T315I mutant (unknown origin) using [gamma-33P]ATP as substrate by radiometric kinase...
Ligand InfoPC cidPC sid
In DepthDetails ArticlePubMed