BDBM50491118 CHEMBL2377388
SMILES CCN(CC)CCOC(=O)C(O)(c1ccccc1)c1c(C)cccc1C
InChI Key InChIKey=MDXUMQALCQXJNR-UHFFFAOYSA-N
Data  3 KI
  Tab Delimited (TSV)   2D SDfile   Computed 3D by Vconf -m prep SDfile
Find this compound or compounds like it in BindingDB:
Activity Spreadsheet -- Enzyme Inhibition Constant Data from BindingDB
Found 3 hits for monomerid = 50491118
TargetMuscarinic acetylcholine receptor M1(Homo sapiens (Human))
Walter Reed Army Institute Of Research
Curated by ChEMBL
LigandPNGBDBM50491118(CHEMBL2377388)
Affinity DataKi:  176nM. Assay description: Displacement of [3H] N-methylscopolamine from human muscarinic M1 receptor expressed in CHOK1 cells after 30 mins by scintillation counting analysis
Ligand InfoPC cidPC sid
In DepthDetails ArticlePubMed
TargetMuscarinic acetylcholine receptor M3(Homo sapiens (Human))
Walter Reed Army Institute Of Research
Curated by ChEMBL
LigandPNGBDBM50491118(CHEMBL2377388)
Affinity DataKi:  254nM. Assay description: Displacement of [3H] N-methylscopolamine from human muscarinic M3 receptor expressed in CHOK1 cells after 30 mins by scintillation counting analysis
Ligand InfoPC cidPC sid
In DepthDetails ArticlePubMed
TargetMuscarinic acetylcholine receptor M2(Homo sapiens (Human))
Walter Reed Army Institute Of Research
Curated by ChEMBL
LigandPNGBDBM50491118(CHEMBL2377388)
Affinity DataKi:  282nM. Assay description: Displacement of [3H] N-methylscopolamine from human muscarinic M2 receptor expressed in CHOK1 cells after 30 mins by scintillation counting analysis
Ligand InfoPC cidPC sid
In DepthDetails ArticlePubMed