BDBM50491125 CHEMBL2377262
SMILES CCN(CC)CCOC(=O)c1ccccc1Sc1ccc(Cl)cc1
InChI Key InChIKey=UNOFGQWDNLJPIO-UHFFFAOYSA-N
Data  4 KI
  Tab Delimited (TSV)   2D SDfile   Computed 3D by Vconf -m prep SDfile
Find this compound or compounds like it in BindingDB:
Activity Spreadsheet -- Enzyme Inhibition Constant Data from BindingDB
Found 4 hits for monomerid = 50491125
TargetMuscarinic acetylcholine receptor M3(Homo sapiens (Human))
Walter Reed Army Institute Of Research
Curated by ChEMBL
LigandPNGBDBM50491125(CHEMBL2377262)
Affinity DataKi:  109nM. Assay description: Displacement of [3H] N-methylscopolamine from human muscarinic M3 receptor expressed in CHOK1 cells after 30 mins by scintillation counting analysis
Ligand InfoPC cidPC sid
In DepthDetails ArticlePubMed
TargetMuscarinic acetylcholine receptor M1(Homo sapiens (Human))
Walter Reed Army Institute Of Research
Curated by ChEMBL
LigandPNGBDBM50491125(CHEMBL2377262)
Affinity DataKi:  519nM. Assay description: Displacement of [3H] N-methylscopolamine from human muscarinic M1 receptor expressed in CHOK1 cells after 30 mins by scintillation counting analysis
Ligand InfoPC cidPC sid
In DepthDetails ArticlePubMed
TargetMuscarinic acetylcholine receptor M2(Homo sapiens (Human))
Walter Reed Army Institute Of Research
Curated by ChEMBL
LigandPNGBDBM50491125(CHEMBL2377262)
Affinity DataKi:  1.34E+3nM. Assay description: Displacement of [3H] N-methylscopolamine from human muscarinic M2 receptor expressed in CHOK1 cells after 30 mins by scintillation counting analysis
Ligand InfoPC cidPC sid
In DepthDetails ArticlePubMed
TargetMuscarinic acetylcholine receptor M1(Homo sapiens (Human))
Walter Reed Army Institute Of Research
Curated by ChEMBL
LigandPNGBDBM50491125(CHEMBL2377262)
Affinity DataKi:  2.67E+3nM. Assay description: Displacement of [3H] N-methylscopolamine from human muscarinic M1 receptor after 30 mins by scintillation counting analysis
Ligand InfoPC cidPC sid
In DepthDetails ArticlePubMed