BDBM50491129 CHEMBL2377268
SMILES CN1CCC(CC1)OC(=O)C(CO)c1cccc(c1)C(F)(F)F
InChI Key InChIKey=WUBQAMJWWIKNOF-UHFFFAOYSA-N
Data  3 KI
  Tab Delimited (TSV)   2D SDfile   Computed 3D by Vconf -m prep SDfile
Find this compound or compounds like it in BindingDB:
Activity Spreadsheet -- Enzyme Inhibition Constant Data from BindingDB
Found 3 hits for monomerid = 50491129
TargetMuscarinic acetylcholine receptor M3(Homo sapiens (Human))
Walter Reed Army Institute Of Research
Curated by ChEMBL
LigandPNGBDBM50491129(CHEMBL2377268)
Affinity DataKi:  11.2nM. Assay description: Displacement of [3H] N-methylscopolamine from human muscarinic M3 receptor expressed in CHOK1 cells after 30 mins by scintillation counting analysis
Ligand InfoPC cidPC sid
In DepthDetails ArticlePubMed
TargetMuscarinic acetylcholine receptor M2(Homo sapiens (Human))
Walter Reed Army Institute Of Research
Curated by ChEMBL
LigandPNGBDBM50491129(CHEMBL2377268)
Affinity DataKi:  30.8nM. Assay description: Displacement of [3H] N-methylscopolamine from human muscarinic M2 receptor expressed in CHOK1 cells after 30 mins by scintillation counting analysis
Ligand InfoPC cidPC sid
In DepthDetails ArticlePubMed
TargetMuscarinic acetylcholine receptor M4(Homo sapiens (Human))
Walter Reed Army Institute Of Research
Curated by ChEMBL
LigandPNGBDBM50491129(CHEMBL2377268)
Affinity DataKi:  285nM. Assay description: Displacement of [3H] N-methylscopolamine from human muscarinic M4 receptor expressed in CHOK1 cells after 30 mins by scintillation counting analysis
Ligand InfoPC cidPC sid
In DepthDetails ArticlePubMed