BDBM50491612 CHEMBL2385933
SMILES COc1cccc(OCCNCCN2C(=O)c3cccc4cccc(C2=O)c34)c1
InChI Key InChIKey=PWJRCEFNZHHJBF-UHFFFAOYSA-N
Data  1 KI
  Tab Delimited (TSV)   2D SDfile   Computed 3D by Vconf -m prep SDfile
Find this compound or compounds like it in BindingDB:
Activity Spreadsheet -- Enzyme Inhibition Constant Data from BindingDB
Found 1 hit for monomerid = 50491612
TargetBeta-hexosaminidase subunit alpha/beta(Homo sapiens (Human))
East China University Of Science And Technology
Curated by ChEMBL
LigandPNGBDBM50491612(CHEMBL2385933)
Affinity DataKi:  930nM. Assay description: Inhibition of human beta-N-acetyl-D-hexosaminidase-A/B using 4-Methylumbelliferyl N-acetyl-beta-D-glucosaminide as substrate incubated for 10 mins pr...
Ligand InfoPC cidPC sid
In DepthDetails ArticlePubMed