BDBM50491615 CHEMBL2385935
SMILES COc1ccc(SCCNCCN2C(=O)c3cccc4cccc(C2=O)c34)cc1
InChI Key InChIKey=DUYWDESTXRBKCT-UHFFFAOYSA-N
Data  1 KI
  Tab Delimited (TSV)   2D SDfile   Computed 3D by Vconf -m prep SDfile
Find this compound or compounds like it in BindingDB:
Activity Spreadsheet -- Enzyme Inhibition Constant Data from BindingDB
Found 1 hit for monomerid = 50491615
TargetBeta-hexosaminidase subunit alpha/beta(Homo sapiens (Human))
East China University Of Science And Technology
Curated by ChEMBL
LigandPNGBDBM50491615(CHEMBL2385935)
Affinity DataKi:  1.13E+3nM. Assay description: Inhibition of human beta-N-acetyl-D-hexosaminidase-A/B using 4-Methylumbelliferyl N-acetyl-beta-D-glucosaminide as substrate incubated for 10 mins pr...
Ligand InfoPC cidPC sid
In DepthDetails ArticlePubMed