BDBM50492401 CHEMBL2403215
SMILES CSCC[C@H](NC(=O)[C@H](Cc1ccccc1)NC(=O)[C@H](CCCNC(N)=N)NC(C)=O)C(=O)NC[C@H](C(=O)N[C@@H](CCSC)C(=O)N[C@@H](CCCCN)C(N)=O)c1cn(C)c2ccccc12
InChI Key InChIKey=WHOOTUPVKAOZJV-GIZYWFQPSA-N
Data  2 EC50
  Tab Delimited (TSV)   2D SDfile   Computed 3D by Vconf -m prep SDfile
Find this compound or compounds like it in BindingDB:
Activity Spreadsheet -- Enzyme Inhibition Constant Data from BindingDB
Found 2 hits for monomerid = 50492401
TargetMu-type opioid receptor(Rattus norvegicus (rat))
Bulgarian Academy Of Sciences
Curated by ChEMBL
LigandPNGBDBM50492401(CHEMBL2403215)
Affinity DataEC50:  1.23E+3nM. Assay description: Activity at Wistar rat mu opioid receptor assessed as inhibition of low-frequency electrically-stimulated vas deferens contraction
Ligand InfoPC cidPC sid
In DepthDetails ArticlePubMed
TargetMu-type opioid receptor(Rattus norvegicus (rat))
Bulgarian Academy Of Sciences
Curated by ChEMBL
LigandPNGBDBM50492401(CHEMBL2403215)
Affinity DataEC50:  1.62E+3nM. Assay description: Activity at Wistar rat mu opioid receptor assessed as inhibition of low-frequency electrically-stimulated vas deferens contraction in presence of nal...
Ligand InfoPC cidPC sid
In DepthDetails ArticlePubMed