BDBM50492955 CHEMBL2414923
SMILES COc1cc2[nH]c-3c(CCc4c[nH]nc-34)c2cc1OC
InChI Key InChIKey=LZBKCEYZDHXUHK-UHFFFAOYSA-N
Data  1 EC50
  Tab Delimited (TSV)   2D SDfile   Computed 3D by Vconf -m prep SDfile
Find this compound or compounds like it in BindingDB:
Activity Spreadsheet -- Enzyme Inhibition Constant Data from BindingDB
Found 1 hit for monomerid = 50492955
TargetMitogen-activated protein kinase 10/Receptor-interacting serine/threonine-protein kinase 1(Homo sapiens (Human))
Chinese Academy Of Sciences
Curated by ChEMBL
LigandPNGBDBM50492955(CHEMBL2414923)
Affinity DataEC50:  47nM. Assay description: Inhibition of RIP1/JNK2 (unknown origin)-mediated necrosis
Ligand InfoPC cidPC sid
In DepthDetails ArticlePubMed