BDBM50493311 rel-RITODRINE
SMILES C[C@@H](NCCc1ccc(O)cc1)[C@@H](O)c1ccc(O)cc1
InChI Key InChIKey=IOVGROKTTNBUGK-SJKOYZFVSA-N
Data  1 Kd
  Tab Delimited (TSV)   2D SDfile   Computed 3D by Vconf -m prep SDfile
Find this compound or compounds like it in BindingDB:
Activity Spreadsheet -- Enzyme Inhibition Constant Data from BindingDB
Found 1 hit for monomerid = 50493311
TargetBeta-2 adrenergic receptor(Homo sapiens (Human))
Medical University Of South Carolina
Curated by ChEMBL
LigandPNGBDBM50493311(rel-RITODRINE)
Affinity DataKd:  0.501nM. Assay description: Binding affinity to beta-2 adrenergic receptor (unknown origin) at 1 to 10000 nM
In DepthDetails ArticlePubMed