BDBM50493604 CHEMBL2436924
SMILES CCCS(=O)(=O)Nc1ccc(F)c(C(=O)Nc2cnc3[nH]c(nc3c2)C(C)C)c1F
InChI Key InChIKey=OOGRUVCBNCZRCH-UHFFFAOYSA-N
Data  2 IC50
  Tab Delimited (TSV)   2D SDfile   Computed 3D by Vconf -m prep SDfile
Find this compound or compounds like it in BindingDB:
Activity Spreadsheet -- Enzyme Inhibition Constant Data from BindingDB
Found 2 hits for monomerid = 50493604
TargetSerine/threonine-protein kinase B-raf(Homo sapiens (Human))
Array Biopharma
Curated by ChEMBL
LigandPNGBDBM50493604(CHEMBL2436924)
Affinity DataIC50:  1.73E+3nM. Assay description: Inhibition of B-Raf V600E mutant in human Malme-3M cells assessed as basal ERK phosphorylation
Ligand InfoPC cidPC sid
In DepthDetails ArticlePubMed
TargetSerine/threonine-protein kinase B-raf(Homo sapiens (Human))
Array Biopharma
Curated by ChEMBL
LigandPNGBDBM50493604(CHEMBL2436924)
Affinity DataIC50:  60nM. Assay description: Inhibition of full length B-Raf V600E mutant (unknown origin)
Ligand InfoPC cidPC sid
In DepthDetails ArticlePubMed