BDBM50493619 CHEMBL2436802
SMILES CCCS(=O)(=O)Nc1ccc(F)c(C(=O)Nc2cnc3[nH]c(nc3c2)-c2ccc(F)c(F)c2)c1F
InChI Key InChIKey=VAOXRZSJXYKAON-UHFFFAOYSA-N
Data  2 IC50
  Tab Delimited (TSV)   2D SDfile   Computed 3D by Vconf -m prep SDfile
Find this compound or compounds like it in BindingDB:
Activity Spreadsheet -- Enzyme Inhibition Constant Data from BindingDB
Found 2 hits for monomerid = 50493619
TargetSerine/threonine-protein kinase B-raf(Homo sapiens (Human))
Array Biopharma
Curated by ChEMBL
LigandPNGBDBM50493619(CHEMBL2436802)
Affinity DataIC50:  194nM. Assay description: Inhibition of B-Raf V600E mutant in human Malme-3M cells assessed as basal ERK phosphorylation
Ligand InfoPC cidPC sid
In DepthDetails ArticlePubMed
TargetSerine/threonine-protein kinase B-raf(Homo sapiens (Human))
Array Biopharma
Curated by ChEMBL
LigandPNGBDBM50493619(CHEMBL2436802)
Affinity DataIC50:  3.40nM. Assay description: Inhibition of full length B-Raf V600E mutant (unknown origin)
Ligand InfoPC cidPC sid
In DepthDetails ArticlePubMed