BDBM50493673 CHEMBL2435013
SMILES CCOC(=O)C(=C\[C-](C(=O)c1cc(OC)c(OC)c(OC)c1)[n+]1ccc(cc1)N(C)C)\C#N
InChI Key InChIKey=FUVFSGJZFRTNGL-SFQUDFHCSA-N
Data  1 IC50
  Tab Delimited (TSV)   2D SDfile   Computed 3D by Vconf -m prep SDfile
Find this compound or compounds like it in BindingDB:
Activity Spreadsheet -- Enzyme Inhibition Constant Data from BindingDB
Found 1 hit for monomerid = 50493673
TargetProtein farnesyltransferase subunit beta/geranylgeranyltransferase type-1 subunit alpha(Homo sapiens (Human))
'Al. I. Cuza' University Of Iasi
Curated by ChEMBL
LigandPNGBDBM50493673(CHEMBL2435013)
Affinity DataIC50:  4.80E+4nM. Assay description: Inhibition of recombinant human farnesyltransferase using Dansyl-GCVLS as substrate measured for 15 mins by fluorimetric analysis
Ligand InfoPC cidPC sid
In DepthDetails ArticlePubMed