BDBM50493674 CHEMBL2435001
SMILES [#6]-[#7](-[#6])-c1cc[n+](cc1)-[#6-](\[#6]=[#6](\C#N)C#N)-[#6](=O)-c1ccc(F)cc1
InChI Key InChIKey=LQMZFQCJDKYOPE-UHFFFAOYSA-N
Data  1 IC50
  Tab Delimited (TSV)   2D SDfile   Computed 3D by Vconf -m prep SDfile
Find this compound or compounds like it in BindingDB:
Activity Spreadsheet -- Enzyme Inhibition Constant Data from BindingDB
Found 1 hit for monomerid = 50493674
TargetProtein farnesyltransferase subunit beta/geranylgeranyltransferase type-1 subunit alpha(Homo sapiens (Human))
'Al. I. Cuza' University Of Iasi
Curated by ChEMBL
LigandPNGBDBM50493674(CHEMBL2435001)
Affinity DataIC50:  2.36E+4nM. Assay description: Inhibition of recombinant human farnesyltransferase using Dansyl-GCVLS as substrate measured for 15 mins by fluorimetric analysis
Ligand InfoPC cidPC sid
In DepthDetails ArticlePubMed