BDBM50493711 CHEMBL2436050
SMILES CCN(CC)C(=O)c1ccc(cc1)C(N1C2CCC1C1CCC2N1CC=C)c1cccc(O)c1
InChI Key InChIKey=IGIUGSUMLYVBEP-UHFFFAOYSA-N
Data  3 KI
  Tab Delimited (TSV)   2D SDfile   Computed 3D by Vconf -m prep SDfile
Find this compound or compounds like it in BindingDB:
Activity Spreadsheet -- Enzyme Inhibition Constant Data from BindingDB
Found 3 hits for monomerid = 50493711
TargetDelta-type opioid receptor(MOUSE)
C.N.R. Istituto Di Farmacologia Traslazionale
Curated by ChEMBL
LigandPNGBDBM50493711(CHEMBL2436050)
Affinity DataKi:  0.230nM. Assay description: Displacement of [3H]DPDPE from mouse brain delta opioid receptor by scintillation counting analysis
Ligand InfoPC cidPC sid
In DepthDetails ArticlePubMed
TargetKappa-type opioid receptor(Mus musculus (Mouse))
C.N.R. Istituto Di Farmacologia Traslazionale
Curated by ChEMBL
LigandPNGBDBM50493711(CHEMBL2436050)
Affinity DataKi:  4.80nM. Assay description: Displacement of [3H]U-69,593 from mouse brain kappa opioid receptor by scintillation counting analysis
Ligand InfoPC cidPC sid
In DepthDetails ArticlePubMed
TargetMu-type opioid receptor(MOUSE)
C.N.R. Istituto Di Farmacologia Traslazionale
Curated by ChEMBL
LigandPNGBDBM50493711(CHEMBL2436050)
Affinity DataKi:  20nM. Assay description: Displacement of [3H]DAMGO from mouse brain mu opioid receptor by scintillation counting analysis
Ligand InfoPC cidPC sid
In DepthDetails ArticlePubMed