BDBM50494229 CHEMBL3215960
SMILES Cl.Cl.[H][C@]12C[C@@H](C[C@](C1)([C@H](C)CN2CCCc1ccccc1)c1cccc(O)c1)NCCC
InChI Key InChIKey=LPOBQLQJMQSYLS-AUOFIJTBSA-N
Data  3 KI  2 EC50
  Tab Delimited (TSV)   2D SDfile   Computed 3D by Vconf -m prep SDfile
Find this compound or compounds like it in BindingDB:
Activity Spreadsheet -- Enzyme Inhibition Constant Data from BindingDB
Found 5 hits for monomerid = 50494229
TargetKappa-type opioid receptor(Homo sapiens (Human))
Research Triangle Institute
Curated by ChEMBL
LigandPNGBDBM50494229(CHEMBL3215960)
Affinity DataKi:  1.40nM. Assay description: Displacement of [3H]U-69593 from human kappa opioid receptor expressed in CHO cells
Ligand InfoPC cidPC sid
In DepthDetails ArticlePubMed
TargetMu-type opioid receptor(Homo sapiens (Human))
Research Triangle Institute
Curated by ChEMBL
LigandPNGBDBM50494229(CHEMBL3215960)
Affinity DataKi:  1.70nM. Assay description: Displacement of [3H]DAMGO from human mu opioid receptor expressed in CHO cells
Ligand InfoPC cidPC sid
In DepthDetails ArticlePubMed
TargetDelta-type opioid receptor(Homo sapiens (Human))
Research Triangle Institute
Curated by ChEMBL
LigandPNGBDBM50494229(CHEMBL3215960)
Affinity DataKi:  74nM. Assay description: Displacement of [3H]DADLE from human delta opioid receptor expressed in CHO cells
Ligand InfoPC cidPC sid
In DepthDetails ArticlePubMed
TargetMu-type opioid receptor(Homo sapiens (Human))
Research Triangle Institute
Curated by ChEMBL
LigandPNGBDBM50494229(CHEMBL3215960)
Affinity DataEC50:  18nM. Assay description: Agonist activity at human mu opioid receptor expressed in CHO cells by [35S]GTPgammaS binding assay
Ligand InfoPC cidPC sid
In DepthDetails ArticlePubMed
TargetKappa-type opioid receptor(Homo sapiens (Human))
Research Triangle Institute
Curated by ChEMBL
LigandPNGBDBM50494229(CHEMBL3215960)
Affinity DataEC50:  293nM. Assay description: Agonist activity at human kappa opioid receptor expressed in CHO cells by [35S]GTPgammaS binding assay
Ligand InfoPC cidPC sid
In DepthDetails ArticlePubMed