BDBM50494338 CHEMBL3087681
SMILES CC(C(=O)NCCCCCCNC1=CC(=O)C(NCCCCCCNC(=O)C(C)c2ccc(c(F)c2)-c2ccccc2)=CC1=O)c1ccc(c(F)c1)-c1ccccc1
InChI Key InChIKey=IHPKWJKSEAEEAP-UHFFFAOYSA-N
Data  2 IC50
  Tab Delimited (TSV)   2D SDfile   Computed 3D by Vconf -m prep SDfile
Find this compound or compounds like it in BindingDB:
Activity Spreadsheet -- Enzyme Inhibition Constant Data from BindingDB
Found 2 hits for monomerid = 50494338
TargetCholinesterase(Homo sapiens (Human))
Alma Mater Studiorum University Of Bologna
Curated by ChEMBL
LigandPNGBDBM50494338(CHEMBL3087681)
Affinity DataIC50: >2.00E+4nM. Assay description: Inhibition of human recombinant BuChE by Ellman's assay
Ligand InfoPC cidPC sid
In DepthDetails ArticlePubMed
TargetAcetylcholinesterase(Homo sapiens (Human))
Alma Mater Studiorum University Of Bologna
Curated by ChEMBL
LigandPNGBDBM50494338(CHEMBL3087681)
Affinity DataIC50: >2.00E+4nM. Assay description: Inhibition of human recombinant AChE by Ellman's assay
Ligand InfoPC cidPC sid
In DepthDetails ArticlePubMed