BDBM50494882 CHEMBL4296730
SMILES Cl.Cl.[H][C@]12Cc3ccc(O)cc3[C@@]3(CCN1CCC)Cc1nc4ccccc4cc1C[C@@]23O
InChI Key InChIKey=NBLUVCZCJORLAD-FHFFSXEHSA-N
Data  3 KI  3 EC50
  Tab Delimited (TSV)   2D SDfile   Computed 3D by Vconf -m prep SDfile
Find this compound or compounds like it in BindingDB:
Activity Spreadsheet -- Enzyme Inhibition Constant Data from BindingDB
Found 6 hits for monomerid = 50494882
TargetDelta-type opioid receptor(MOUSE)
Kitasato University
Curated by ChEMBL
LigandPNGBDBM50494882(CHEMBL4296730)
Affinity DataKi:  0.162nM. Assay description: Displacement of [3H]-DPDPE from delta opioid receptor in mouse whole brain membranes without cerebellum after 1 hr by liquid scintillation counting a...
Ligand InfoPC cidPC sid
In DepthDetails ArticlePubMed
TargetKappa-type opioid receptor(Cavia porcellus (domestic guinea pig))
Kitasato University
Curated by ChEMBL
LigandPNGBDBM50494882(CHEMBL4296730)
Affinity DataKi:  26nM. Assay description: Displacement of [3H]-U-69593 from kappa opioid receptor in guinea pig cerebellum after 1 hr by liquid scintillation counting analysis
Ligand InfoPC cidPC sid
In DepthDetails ArticlePubMed
TargetMu-type opioid receptor(MOUSE)
Kitasato University
Curated by ChEMBL
LigandPNGBDBM50494882(CHEMBL4296730)
Affinity DataKi:  46nM. Assay description: Displacement of [3H]-DAMGO from mu opioid receptor in mouse whole brain membranes without cerebellum after 1 hr by liquid scintillation counting anal...
Ligand InfoPC cidPC sid
In DepthDetails ArticlePubMed
TargetKappa-type opioid receptor(Homo sapiens (Human))
Kitasato University
Curated by ChEMBL
LigandPNGBDBM50494882(CHEMBL4296730)
Affinity DataEC50: >1.00E+3nM. Assay description: Agonist activity at human recombinant kappa opioid receptor expressed in CHO cells after 2 hrs by [35S]GTPgammaS binding assay
Ligand InfoPC cidPC sid
In DepthDetails ArticlePubMed
TargetDelta-type opioid receptor(Homo sapiens (Human))
Kitasato University
Curated by ChEMBL
LigandPNGBDBM50494882(CHEMBL4296730)
Affinity DataEC50:  1.20nM. Assay description: Agonist activity at human recombinant delta opioid receptor expressed in CHO cells after 2 hrs by [35S]GTPgammaS binding assay
Ligand InfoPC cidPC sid
In DepthDetails ArticlePubMed
TargetMu-type opioid receptor(Homo sapiens (Human))
Kitasato University
Curated by ChEMBL
LigandPNGBDBM50494882(CHEMBL4296730)
Affinity DataEC50: >1.00E+3nM. Assay description: Agonist activity at human recombinant mu opioid receptor expressed in CHO cells after 2 hrs by [35S]GTPgammaS binding assay
Ligand InfoPC cidPC sid
In DepthDetails ArticlePubMed