BDBM50494906 CHEMBL3098191
SMILES COc1c(C)c2COC(=O)c2c(O)c1CCOP(O)(=O)CP(O)(=O)OC[C@H]1O[C@H]([C@H](O)[C@@H]1O)n1cnc2c(N)nc(nc12)-c1cccs1
InChI Key InChIKey=NDBGVXISJSTOQX-WUINPQGNSA-N
Data  2 KI
  Tab Delimited (TSV)   2D SDfile   Computed 3D by Vconf -m prep SDfile
Find this compound or compounds like it in BindingDB:
Activity Spreadsheet -- Enzyme Inhibition Constant Data from BindingDB
Found 2 hits for monomerid = 50494906
TargetInosine-5'-monophosphate dehydrogenase 2(Homo sapiens (Human))
University Of Minnesota
Curated by ChEMBL
LigandPNGBDBM50494906(CHEMBL3098191)
Affinity DataKi:  56nM. Assay description: Inhibition of IMPDH2 (unknown origin)
Ligand InfoPC cidPC sid
In DepthDetails ArticlePubMed
TargetLanosterol synthase(Homo sapiens (Human))
University Of Minnesota
Curated by ChEMBL
LigandPNGBDBM50494906(CHEMBL3098191)
Affinity DataKi:  82nM. Assay description: Inhibition of IMPDH1 (unknown origin)
Ligand InfoPC cidPC sid
In DepthDetails ArticlePubMed