BDBM50494923 CHEMBL3098185
SMILES COc1c(C)c2COC(=O)c2c(O)c1C\C=C(/C)CCC(=O)NCC(=O)NC[C@H]1O[C@H]([C@H](O)[C@@H]1O)n1cnc2c(N)ncnc12
InChI Key InChIKey=UKPVKKVQROAFKF-REKGTSTESA-N
Data  2 KI
  Tab Delimited (TSV)   2D SDfile   Computed 3D by Vconf -m prep SDfile
Find this compound or compounds like it in BindingDB:
Activity Spreadsheet -- Enzyme Inhibition Constant Data from BindingDB
Found 2 hits for monomerid = 50494923
TargetInosine-5'-monophosphate dehydrogenase 2(Homo sapiens (Human))
University Of Minnesota
Curated by ChEMBL
LigandPNGBDBM50494923(CHEMBL3098185)
Affinity DataKi:  188nM. Assay description: Inhibition of IMPDH2 (unknown origin)
Ligand InfoPC cidPC sid
In DepthDetails ArticlePubMed
TargetLanosterol synthase(Homo sapiens (Human))
University Of Minnesota
Curated by ChEMBL
LigandPNGBDBM50494923(CHEMBL3098185)
Affinity DataKi:  259nM. Assay description: Inhibition of IMPDH1 (unknown origin)
Ligand InfoPC cidPC sid
In DepthDetails ArticlePubMed