BDBM50494989 CHEMBL3099534
SMILES Fc1ccc(cc1)N1CCN(CC1)S(=O)(=O)c1ccc2NC(=O)C(=O)c2c1
InChI Key InChIKey=LXQAUKSDEFRKSR-UHFFFAOYSA-N
Data  1 IC50
  Tab Delimited (TSV)   2D SDfile   Computed 3D by Vconf -m prep SDfile
Find this compound or compounds like it in BindingDB:
Activity Spreadsheet -- Enzyme Inhibition Constant Data from BindingDB
Found 1 hit for monomerid = 50494989
TargetReplicase polyprotein 1ab(Human SARS coronavirus (SARS-CoV) (Severe acute re...)
Tianjin University Of Science And Technology
Curated by ChEMBL
LigandPNGBDBM50494989(CHEMBL3099534)
Affinity DataIC50: >1.00E+5nM. Assay description: Inhibition of GST-tagged SARS coronavirus 3C-like protease by FRET assay
Ligand InfoPC cidPC sid
In DepthDetails ArticlePubMed