BDBM50495240 CHEMBL3104278
SMILES NC(=O)CCSc1nc(N)nc(n1)-c1c(Cl)cc2COCc3cccc1c23
InChI Key InChIKey=AYIHRTIHCFRHKZ-UHFFFAOYSA-N
Data  1 Kd
  Tab Delimited (TSV)   2D SDfile   Computed 3D by Vconf -m prep SDfile
Find this compound or compounds like it in BindingDB:
Activity Spreadsheet -- Enzyme Inhibition Constant Data from BindingDB
Found 1 hit for monomerid = 50495240
TargetHeat shock protein HSP 90-alpha(Homo sapiens (Human))
Chugai Pharmaceutical
Curated by ChEMBL
LigandPNGBDBM50495240(CHEMBL3104278)
Affinity DataKd:  0.660nM. Assay description: Binding affinity to human biotinylated N-terminal Hsp90alpha (9 to 236) by surface plasmon resonance assay
Ligand InfoPC cidPC sid
In DepthDetails ArticlePubMed