BDBM50495396 CHEMBL3110296
SMILES COc1ccc2[nH]cc(CCNC(=O)c3cc(=O)c4ccc(OCc5ccc(Br)cc5)cc4o3)c2c1
InChI Key InChIKey=NTWNRLYBRGXSOK-UHFFFAOYSA-N
Data  1 IC50  3 EC50
  Tab Delimited (TSV)   2D SDfile   Computed 3D by Vconf -m prep SDfile
Find this compound or compounds like it in BindingDB:
Activity Spreadsheet -- Enzyme Inhibition Constant Data from BindingDB
Found 4 hits for monomerid = 50495396
TargetBroad substrate specificity ATP-binding cassette transporter ABCG2(Homo sapiens (Human))
Bmssi Umr 5086 Cnrs/Universit£
Curated by ChEMBL
LigandPNGBDBM50495396(CHEMBL3110296)
Affinity DataEC50:  1.54E+3nM. Assay description: Inhibition of ABCG2-mediated mitoxantrone efflux in mitoxantrone-selected human H460 cells after 30 mins by flow cytometric analysis
Ligand InfoPC cidPC sid
In DepthDetails ArticlePubMed
TargetBroad substrate specificity ATP-binding cassette transporter ABCG2(Homo sapiens (Human))
Bmssi Umr 5086 Cnrs/Universit£
Curated by ChEMBL
LigandPNGBDBM50495396(CHEMBL3110296)
Affinity DataEC50:  1.27E+9nM. Assay description: Inhibition of ABCG2 (unknown origin) expressed in HEK293 cells assessed as increase in mitoxantrone accumulation incubated for 30 mins by flow cytome...
Ligand InfoPC cidPC sid
In DepthDetails ArticlePubMed
TargetBroad substrate specificity ATP-binding cassette transporter ABCG2(Homo sapiens (Human))
Bmssi Umr 5086 Cnrs/Universit£
Curated by ChEMBL
LigandPNGBDBM50495396(CHEMBL3110296)
Affinity DataEC50:  1.27E+3nM. Assay description: Inhibition of ABCG2 (unknown origin)-mediated mitoxantrone efflux expressed in HEK293 cells after 30 mins by flow cytometric analysis
Ligand InfoPC cidPC sid
In DepthDetails ArticlePubMed
TargetBroad substrate specificity ATP-binding cassette transporter ABCG2(Homo sapiens (Human))
Bmssi Umr 5086 Cnrs/Universit£
Curated by ChEMBL
LigandPNGBDBM50495396(CHEMBL3110296)
Affinity DataIC50:  10nM. Assay description: Inhibition of human ABCG2 expressed in Sf9 insect cell membranes assessed as inhibition of quercetin-stimulated ATPase activity after 30 mins by colo...
Ligand InfoPC cidPC sid
In DepthDetails ArticlePubMed