BDBM50495431 CHEMBL3108800
SMILES Cc1nnc2c3ccccc3c(nn12)-c1ccc(N2CCOCC2)c(NS(C)(=O)=O)c1
InChI Key InChIKey=MYFFGZYMLKZBPZ-UHFFFAOYSA-N
Data  4 IC50
  Tab Delimited (TSV)   2D SDfile   Computed 3D by Vconf -m prep SDfile
Find this compound or compounds like it in BindingDB:
Activity Spreadsheet -- Enzyme Inhibition Constant Data from BindingDB
Found 4 hits for monomerid = 50495431
TargetChromatin remodeling regulator CECR2(Homo sapiens (Human))
University Of Oxford
Curated by ChEMBL
LigandPNGBDBM50495431(CHEMBL3108800)
Affinity DataIC50:  158nM. Assay description: Displacement of H4Ac4 peptide from CECR2 bromodomain (unknown origin) by AlphaScreen assay
Ligand InfoPC cidPC sid
In DepthDetails ArticlePubMed
TargetBromodomain-containing protein 4(Homo sapiens (Human))
University Of Oxford
Curated by ChEMBL
LigandPNGBDBM50495431(CHEMBL3108800)
Affinity DataIC50:  251nM. Assay description: Displacement of H4Ac4 peptide from BRD4 bromodomain-1 (unknown origin) by AlphaScreen assay
Ligand InfoPC cidPC sid
In DepthDetails ArticlePubMed
TargetBromodomain-containing protein 9(Homo sapiens (Human))
University Of Oxford
Curated by ChEMBL
LigandPNGBDBM50495431(CHEMBL3108800)
Affinity DataIC50:  316nM. Assay description: Displacement of H2K9(Ac)K13(Ac)K15(Ac) peptide from BRD9 bromodomain (unknown origin) by AlphaScreen assay
Ligand InfoPC cidPC sid
In DepthDetails ArticlePubMed
TargetCREB-binding protein(Homo sapiens (Human))
University Of Oxford
Curated by ChEMBL
LigandPNGBDBM50495431(CHEMBL3108800)
Affinity DataIC50:  631nM. Assay description: Displacement of H3K56(Ac) peptide from CREBBP bromodomain (unknown origin) by AlphaScreen assay
Ligand InfoPC cidPC sid
In DepthDetails ArticlePubMed