BDBM50496372 CHEMBL3126478
SMILES [H][C@@]12CC(C)(C)CC[C@@]1(CC[C@]1(C)C2=CC[C@]2([H])[C@@]3(C)CC[C@H](OC(=O)c4ccccc4C(O)=O)C(C)(C)[C@]3([H])CC[C@@]12C)C(=O)OCc1ccccc1
InChI Key InChIKey=KJKPWRYDWLCKDF-JNNZJYSRSA-N
Data  1 IC50
  Tab Delimited (TSV)   2D SDfile   Computed 3D by Vconf -m prep SDfile
Find this compound or compounds like it in BindingDB:
Activity Spreadsheet -- Enzyme Inhibition Constant Data from BindingDB
Found 1 hit for monomerid = 50496372
TargetProtease(Human immunodeficiency virus 1 (HIV-1))
Universidad De Granada
Curated by ChEMBL
LigandPNGBDBM50496372(CHEMBL3126478)
Affinity DataIC50:  400nM. Assay description: Inhibition of HIV1 recombinant protease expressed in Escherichia coli using Abz-Ala-Arg-Val-Nle-Tyr(NO2)-Glu-Ala-Nle-NH2 as substrate by FRET assay
Ligand InfoPC cidPC sid
In DepthDetails ArticlePubMed