BDBM50496607 CHEMBL3134407
SMILES CCCCCCCCCC(=O)N\N=C\c1ccc(OC(=O)c2cccc(Br)c2)cc1
InChI Key InChIKey=MAWOUXUVCBPNNV-NLRVBDNBSA-N
Data  1 IC50
  Tab Delimited (TSV)   2D SDfile   Computed 3D by Vconf -m prep SDfile
Find this compound or compounds like it in BindingDB:
Activity Spreadsheet -- Enzyme Inhibition Constant Data from BindingDB
Found 1 hit for monomerid = 50496607
TargetDNA topoisomerase 1(Yersinia pestis)
University Of Hawai'I At Hilo
Curated by ChEMBL
LigandPNGBDBM50496607(CHEMBL3134407)
Affinity DataIC50: >2.50E+5nM. Assay description: Inhibition of Yersinia pestis topoisomerase 1-mediated relaxation of supercoiled plasmid DNA by agarose gel electrophoresis
In DepthDetails ArticlePubMed