BDBM50496736 CHEMBL3220784
SMILES [Li;v0+].[#6]-[#6]-[#8]P([#8-])(=O)[#6](-[#6])=O
InChI Key InChIKey=WUXJCOASEDOVAS-UHFFFAOYSA-M
Data  1 KI
  Tab Delimited (TSV)   2D SDfile   Computed 3D by Vconf -m prep SDfile
Find this compound or compounds like it in BindingDB:
Activity Spreadsheet -- Enzyme Inhibition Constant Data from BindingDB
Found 1 hit for monomerid = 50496736
Target1-deoxy-D-xylulose-5-phosphate synthase(Escherichia coli K-12 (Enterobacteria))
The Johns Hopkins University School Of Medicine
Curated by ChEMBL
LigandPNGBDBM50496736(CHEMBL3220784)
Affinity DataKi:  6.70E+3nM. Assay description: Competitive inhibition of ThDP-dependent Escherichia coli DXP synthase using pyruvate as substrate assessed as NADPH consumption by spectrophotometri...
Ligand InfoPC cidPC sid
In DepthDetails ArticlePubMed