BDBM50496739 CHEMBL3220787
SMILES [Li;v0+].[#6]-[#6]-[#6]-[#6](=O)P([#8-])(=O)[#8]-[#6]
InChI Key InChIKey=BYDFQLKJOXPSTM-UHFFFAOYSA-M
Data  1 KI
  Tab Delimited (TSV)   2D SDfile   Computed 3D by Vconf -m prep SDfile
Find this compound or compounds like it in BindingDB:
Activity Spreadsheet -- Enzyme Inhibition Constant Data from BindingDB
Found 1 hit for monomerid = 50496739
Target1-deoxy-D-xylulose-5-phosphate synthase(Escherichia coli K-12 (Enterobacteria))
The Johns Hopkins University School Of Medicine
Curated by ChEMBL
LigandPNGBDBM50496739(CHEMBL3220787)
Affinity DataKi: >1.00E+6nM. Assay description: Competitive inhibition of ThDP-dependent Escherichia coli DXP synthase using pyruvate as substrate assessed as NADPH consumption by spectrophotometri...
Ligand InfoPC cidPC sid
In DepthDetails ArticlePubMed