BDBM50497023 CHEMBL3233205
SMILES Nc1nc2nc(SCC(=O)c3ccc(F)cc3)[nH]c2c(=O)[nH]1
InChI Key InChIKey=ZLERBGHZYPNJLP-UHFFFAOYSA-N
Data  1 IC50  1 Kd
  Tab Delimited (TSV)   2D SDfile   Computed 3D by Vconf -m prep SDfile
Find this compound or compounds like it in BindingDB:
Activity Spreadsheet -- Enzyme Inhibition Constant Data from BindingDB
Found 2 hits for monomerid = 50497023
Target2-amino-4-hydroxy-6-hydroxymethyldihydropteridine pyrophosphokinase(Escherichia coli (strain K12))
St. Jude Children'S Research Hospital
Curated by ChEMBL
LigandPNGBDBM50497023(CHEMBL3233205)
Affinity DataIC50:  7.90E+4nM. Assay description: Inhibition of GST-tagged Escherichia coli HPPK expressed in Escherichia coli using 6-hydroxymethyl-7,8-dihydropterin hydrochloride as substrate after...
Ligand InfoPC cidPC sid
In DepthDetails ArticlePubMed
Target2-amino-4-hydroxy-6-hydroxymethyldihydropteridine pyrophosphokinase(Escherichia coli (strain K12))
St. Jude Children'S Research Hospital
Curated by ChEMBL
LigandPNGBDBM50497023(CHEMBL3233205)
Affinity DataKd:  1.12E+4nM. Assay description: Binding affinity to GST-tagged Escherichia coli HPPK expressed in Escherichia coli by SPR assay based alternative equilibrium affinity method in pres...
Ligand InfoPC cidPC sid
In DepthDetails ArticlePubMed