BDBM50497030 CHEMBL3233203
SMILES Cc1ccc(cc1)C(=O)CSc1nc2nc(N)[nH]c(=O)c2[nH]1
InChI Key InChIKey=HIGGTDYQNPXEFT-UHFFFAOYSA-N
Data  1 IC50  1 Kd
PDB links: 1 PDB ID matches this monomer.
  Tab Delimited (TSV)   2D SDfile   Computed 3D by Vconf -m prep SDfile
Find this compound or compounds like it in BindingDB:
Activity Spreadsheet -- Enzyme Inhibition Constant Data from BindingDB
Found 2 hits for monomerid = 50497030
Target2-amino-4-hydroxy-6-hydroxymethyldihydropteridine pyrophosphokinase(Escherichia coli (strain K12))
St. Jude Children'S Research Hospital
Curated by ChEMBL
LigandPNGBDBM50497030(CHEMBL3233203)
Affinity DataKd:  6.70E+3nM. Assay description: Binding affinity to GST-tagged Escherichia coli HPPK expressed in Escherichia coli by SPR assay based alternative equilibrium affinity method in pres...
Ligand InfoPC cidPC sidPDB
Target2-amino-4-hydroxy-6-hydroxymethyldihydropteridine pyrophosphokinase(Escherichia coli (strain K12))
St. Jude Children'S Research Hospital
Curated by ChEMBL
LigandPNGBDBM50497030(CHEMBL3233203)
Affinity DataIC50:  6.40E+4nM. Assay description: Inhibition of GST-tagged Escherichia coli HPPK expressed in Escherichia coli using 6-hydroxymethyl-7,8-dihydropterin hydrochloride as substrate after...
Ligand InfoPC cidPC sidPDB