BDBM50497372 CHEMBL3339107
SMILES FC(F)(F)C1(CC1)c1cc(NC(=O)Nc2ccccc2Br)n(n1)-c1ccccc1
InChI Key InChIKey=ZAHIZIPRWCNRES-UHFFFAOYSA-N
Data  2 IC50
  Tab Delimited (TSV)   2D SDfile   Computed 3D by Vconf -m prep SDfile
Find this compound or compounds like it in BindingDB:
Activity Spreadsheet -- Enzyme Inhibition Constant Data from BindingDB
Found 2 hits for monomerid = 50497372
TargetG protein-activated inward rectifier potassium channel 4(Homo sapiens (Human))
Northwest A&F University
Curated by ChEMBL
LigandPNGBDBM50497372(CHEMBL3339107)
Affinity DataIC50:  3.20E+3nM. Assay description: Inhibition of GIRK1/4 (unknown origin) by thallium-flux based assay
Ligand InfoPC cidPC sid
In DepthDetails ArticlePubMed
TargetG protein-activated inward rectifier potassium channel 1(Homo sapiens (Human))
Northwest A&F University
Curated by ChEMBL
LigandPNGBDBM50497372(CHEMBL3339107)
Affinity DataIC50:  3.80E+3nM. Assay description: Inhibition of GIRK1/2 (unknown origin) by thallium-flux based assay
Ligand InfoPC cidPC sid
In DepthDetails ArticlePubMed