BDBM50497458 CHEMBL3343994
SMILES N[C@H](Cc1ccc(NC(N)=N)cc1)C(=O)N[C@@H](Cc1ccccc1)C(N)=O
InChI Key InChIKey=JGVSHHWPQVGYRT-CVEARBPZSA-N
Data  3 EC50
  Tab Delimited (TSV)   2D SDfile   Computed 3D by Vconf -m prep SDfile
Find this compound or compounds like it in BindingDB:
Activity Spreadsheet -- Enzyme Inhibition Constant Data from BindingDB
Found 3 hits for monomerid = 50497458
TargetMas-related G-protein coupled receptor member X1(Homo sapiens (Human))
Johns Hopkins University
Curated by ChEMBL
LigandPNGBDBM50497458(CHEMBL3343994)
Affinity DataEC50: <1.00E+5nM. Assay description: Agonist activity at human MrgX1 transfected in HEK293 cells by FLIPR assay
Ligand InfoPC cidPC sid
In DepthDetails ArticlePubMed
TargetMas-related G-protein coupled receptor member X1(Rattus norvegicus)
Johns Hopkins University
Curated by ChEMBL
LigandPNGBDBM50497458(CHEMBL3343994)
Affinity DataEC50:  631nM. Assay description: Agonist activity at rat MrgX1 transfected in HEK293 cells by FLIPR assay
Ligand InfoPC cidPC sid
In DepthDetails ArticlePubMed
TargetMas-related G-protein coupled receptor member X1(Mus musculus)
Johns Hopkins University
Curated by ChEMBL
LigandPNGBDBM50497458(CHEMBL3343994)
Affinity DataEC50:  1.26E+3nM. Assay description: Agonist activity at mouse MrgC11 transfected in HEK293 cells by FLIPR assay
Ligand InfoPC cidPC sid
In DepthDetails ArticlePubMed