BDBM50498430 CHEMBL3594112
SMILES c1ccncc1.[H][C@@]12CC[C@H](C)[C@@]1(C)CC[C@@]1([H])[C@@]2([H])CC[C@]2([H])C[C@@H](CC[C@]12C)OS(O)(=O)=O
InChI Key InChIKey=BDSXXJFSNJFFJG-NFPPDZCFSA-N
Data  4 IC50
  Tab Delimited (TSV)   2D SDfile   Computed 3D by Vconf -m prep SDfile
Find this compound or compounds like it in BindingDB:
Activity Spreadsheet -- Enzyme Inhibition Constant Data from BindingDB
Found 4 hits for monomerid = 50498430
TargetGlutamate receptor ionotropic, NMDA 1/2A(Homo sapiens (Human))
Academy Of Sciences Of The Czech Republic V.V.I.
Curated by ChEMBL
LigandPNGBDBM50498430(CHEMBL3594112)
Affinity DataIC50:  600nM. Assay description: Inhibition of recombinant GluN1/GluN2A receptor (unknown origin) expressed in HEK293 cells assessed as inhibition of glutamate-evoked current by whol...
Ligand InfoPC cidPC sid
In DepthDetails ArticlePubMed
TargetGlutamate receptor ionotropic, NMDA 1/2B(Homo sapiens (Human))
Academy Of Sciences Of The Czech Republic V.V.I.
Curated by ChEMBL
LigandPNGBDBM50498430(CHEMBL3594112)
Affinity DataIC50:  600nM. Assay description: Inhibition of recombinant GluN1/GluN2B receptor (unknown origin) expressed in HEK293 cells assessed as inhibition of glutamate-evoked current by whol...
Ligand InfoPC cidPC sid
In DepthDetails ArticlePubMed
TargetGlutamate receptor ionotropic, NMDA 1/2D(Homo sapiens (Human))
Academy Of Sciences Of The Czech Republic V.V.I.
Curated by ChEMBL
LigandPNGBDBM50498430(CHEMBL3594112)
Affinity DataIC50:  500nM. Assay description: Inhibition of recombinant GluN1/GluN2D receptor (unknown origin) expressed in HEK293 cells assessed as inhibition of glutamate-evoked current by whol...
Ligand InfoPC cidPC sid
In DepthDetails ArticlePubMed
TargetGlutamate receptor ionotropic, NMDA 1/2C(Homo sapiens (Human))
Academy Of Sciences Of The Czech Republic V.V.I.
Curated by ChEMBL
LigandPNGBDBM50498430(CHEMBL3594112)
Affinity DataIC50:  400nM. Assay description: Inhibition of recombinant GluN1/GluN2C receptor (unknown origin) expressed in HEK293 cells assessed as inhibition of glutamate-evoked current by whol...
Ligand InfoPC cidPC sid
In DepthDetails ArticlePubMed