BDBM50498788 CHEMBL3623717
SMILES CSCC[C@H](NC(=O)CCn1c2ccccc2c2ccccc12)C(O)=O
InChI Key InChIKey=WGJAHUBTCWNFTC-INIZCTEOSA-N
Data  1 IC50
  Tab Delimited (TSV)   2D SDfile   Computed 3D by Vconf -m prep SDfile
Find this compound or compounds like it in BindingDB:
Activity Spreadsheet -- Enzyme Inhibition Constant Data from BindingDB
Found 1 hit for monomerid = 50498788
TargetProtein farnesyltransferase subunit beta/geranylgeranyltransferase type-1 subunit alpha(Homo sapiens (Human))
Alexandru Ioan Cuza University
Curated by ChEMBL
LigandPNGBDBM50498788(CHEMBL3623717)
Affinity DataIC50:  4.02E+4nM. Assay description: Inhibition of recombinant human FTase using FPP/dansyl-GCVLS as substrate measured for 15 mins by fluorimetric analysis
Ligand InfoPC cidPC sid
In DepthDetails ArticlePubMed