BDBM50498943 CHEMBL3735409
SMILES CCCc1nc2c(C)cc(cc2n1Cc1ccc(cc1)-c1ccccc1-c1nnn[nH]1)C(=O)NC[C@@H](C)c1ccccc1
InChI Key InChIKey=SESMVBDEQODYAX-XMMPIXPASA-N
Data  1 IC50
  Tab Delimited (TSV)   2D SDfile   Computed 3D by Vconf -m prep SDfile
Find this compound or compounds like it in BindingDB:
Activity Spreadsheet -- Enzyme Inhibition Constant Data from BindingDB
Found 1 hit for monomerid = 50498943
TargetType-1 angiotensin II receptor(Homo sapiens (Human))
Beijing Institute Of Technology
Curated by ChEMBL
LigandPNGBDBM50498943(CHEMBL3735409)
Affinity DataIC50:  5nM. Assay description: Displacement of [125I]Sar1Ile8-Ang2 from human AT1 receptor expressed in CHO-K1 cell membranes after 180 mins
Ligand InfoPC cidPC sid
In DepthDetails ArticlePubMed