BDBM50499726 CHEMBL3742181
SMILES Fc1ccc(Br)c(c1)C(=O)c1ccc(OCC(=O)Nc2cccnc2)cc1
InChI Key InChIKey=ZUIZBOPGEGXBIA-UHFFFAOYSA-N
Data  1 EC50
  Tab Delimited (TSV)   2D SDfile   Computed 3D by Vconf -m prep SDfile
Find this compound or compounds like it in BindingDB:
Activity Spreadsheet -- Enzyme Inhibition Constant Data from BindingDB
Found 1 hit for monomerid = 50499726
Target1,3-beta-glucan synthase component GSC2(Saccharomyces cerevisiae)
Leiden University
Curated by ChEMBL
LigandPNGBDBM50499726(CHEMBL3742181)
Affinity DataEC50:  4.60E+3nM. Assay description: Induction of dissociation of [3H]-dofetilide from Kv11.1 channel (unknown origin) assessed as dissociation rate expressed in HEK293 cells after 1 hr
Ligand InfoPC cidPC sid
In DepthDetails ArticlePubMed