BDBM50499745 CHEMBL3741267
SMILES NC(=O)C[C@H](NC(=O)[C@@H]1CCCN1S(=O)(=O)c1ccc(cc1F)-c1ccc(F)cc1)C#N
InChI Key InChIKey=SPWVWBMBDVFATG-WMZOPIPTSA-N
Data  1 IC50
  Tab Delimited (TSV)   2D SDfile   Computed 3D by Vconf -m prep SDfile
Find this compound or compounds like it in BindingDB:
Activity Spreadsheet -- Enzyme Inhibition Constant Data from BindingDB
Found 1 hit for monomerid = 50499745
TargetLegumain(Homo sapiens (Human))
Queen'S University Belfast
Curated by ChEMBL
LigandPNGBDBM50499745(CHEMBL3741267)
Affinity DataIC50:  23nM. Assay description: Inhibition of recombinant human legumain using Z-Ala-Ala-Asn-MCA substrate measured every 2 mins for 60 mins by microplate reader analysis
Ligand InfoPC cidPC sid
In DepthDetails ArticlePubMed