BDBM50499807 CHEMBL3740280
SMILES [H][C@]12CC[C@@]3([H])C4(C)COC[C@@]3(C[C@H]([C@@H]4OC[C@](C)(NCCCC)C(C)C)n3nnc(N)n3)C1=CC[C@@]1(C)[C@H](C(O)=O)[C@](C)(CC[C@]21C)[C@H](C)C(C)C
InChI Key InChIKey=SPPJERVAFSOKPH-NOVKVKRDSA-N
Data  1 IC50
  Tab Delimited (TSV)   2D SDfile   Computed 3D by Vconf -m prep SDfile
Find this compound or compounds like it in BindingDB:
Activity Spreadsheet -- Enzyme Inhibition Constant Data from BindingDB
Found 1 hit for monomerid = 50499807
Target1,3-beta-D-glucan synthase catalytic subunit(Candida albicans)
Merck Research Laboratories
Curated by ChEMBL
LigandPNGBDBM50499807(CHEMBL3740280)
Affinity DataIC50:  14.1nM. Assay description: Displacement of UDP-[3H]glucose from beta-1,3-glucan synthase in Candida albicans MY1055 microsomal membranes incubated for 2 hrs
Ligand InfoPC cidPC sid
In DepthDetails ArticlePubMed