BDBM50499816 CHEMBL3740596
SMILES CC(=S)Nc1ccccc1
InChI Key InChIKey=MWCGLTCRJJFXKR-UHFFFAOYSA-N
Data  1 KI  1 IC50
  Tab Delimited (TSV)   2D SDfile   Computed 3D by Vconf -m prep SDfile
Find this compound or compounds like it in BindingDB:
Activity Spreadsheet -- Enzyme Inhibition Constant Data from BindingDB
Found 2 hits for monomerid = 50499816
TargetPolyphenol oxidase 2(Agaricus bisporus (Common mushroom))
Kyungpook National University
Curated by ChEMBL
LigandPNGBDBM50499816(CHEMBL3740596)
Affinity DataKi:  1.20E+3nM. Assay description: Competitive inhibition of mushroom tyrosinase using L-tyrosine as substrate by Lineweaver-Burk plots analysis
In DepthDetails ArticlePubMed
TargetPolyphenol oxidase 2(Agaricus bisporus (Common mushroom))
Kyungpook National University
Curated by ChEMBL
LigandPNGBDBM50499816(CHEMBL3740596)
Affinity DataIC50:  4.10E+3nM. Assay description: Inhibition of mushroom tyrosinase using L-tyrosine as substrate
In DepthDetails ArticlePubMed