BDBM50499957 CHEMBL3739529
SMILES CC(C)(C)OC(=O)ON(C(=O)CCCCCCC(=O)N(OC(=O)OC(C)(C)C)C(=O)OC(C)(C)C)C(=O)OC(C)(C)C
InChI Key InChIKey=WSBNJHLXNBKHKI-UHFFFAOYSA-N
Data  4 IC50  1 EC50
  Tab Delimited (TSV)   2D SDfile   Computed 3D by Vconf -m prep SDfile
Find this compound or compounds like it in BindingDB:
Activity Spreadsheet -- Enzyme Inhibition Constant Data from BindingDB
Found 5 hits for monomerid = 50499957
TargetHistone deacetylase 2(Homo sapiens (Human))
University Of Geneva
Curated by ChEMBL
LigandPNGBDBM50499957(CHEMBL3739529)
Affinity DataIC50:  2.99E+4nM. Assay description: Inhibition of HDAC2 (unknown origin) by fluorimetric assay
Ligand InfoPC cidPC sid
In DepthDetails ArticlePubMed
TargetHistone deacetylase 6(Homo sapiens (Human))
University Of Geneva
Curated by ChEMBL
LigandPNGBDBM50499957(CHEMBL3739529)
Affinity DataEC50:  5.00E+3nM. Assay description: Inhibition of HDAC6 in human HeLa cells assessed as inhibition of tubulin deacetylation incubated for overnight by cELISA
Ligand InfoPC cidPC sid
In DepthDetails ArticlePubMed
TargetHistone deacetylase 3(Homo sapiens (Human))
University Of Geneva
Curated by ChEMBL
LigandPNGBDBM50499957(CHEMBL3739529)
Affinity DataIC50: >1.00E+5nM. Assay description: Inhibition of HDAC3 (unknown origin) by fluorimetric assay
Ligand InfoPC cidPC sid
In DepthDetails ArticlePubMed
TargetHistone deacetylase 1(Homo sapiens (Human))
University Of Geneva
Curated by ChEMBL
LigandPNGBDBM50499957(CHEMBL3739529)
Affinity DataIC50:  3.06E+4nM. Assay description: Inhibition of HDAC1 (unknown origin) by fluorimetric assay
Ligand InfoPC cidPC sid
In DepthDetails ArticlePubMed
TargetHistone deacetylase 6(Homo sapiens (Human))
University Of Geneva
Curated by ChEMBL
LigandPNGBDBM50499957(CHEMBL3739529)
Affinity DataIC50:  3.39E+3nM. Assay description: Inhibition of HDAC6 (unknown origin) by fluorimetric assay
Ligand InfoPC cidPC sid
In DepthDetails ArticlePubMed