BDBM50500011 CHEMBL3739533
SMILES O=C1N(Cc2ccc(CCN3CCN(CC3)c3ccccn3)cc2)C(=O)c2ccccc12
InChI Key InChIKey=UBOIPDLRIIBNGN-UHFFFAOYSA-N
Data  3 IC50
  Tab Delimited (TSV)   2D SDfile   Computed 3D by Vconf -m prep SDfile
Find this compound or compounds like it in BindingDB:
Activity Spreadsheet -- Enzyme Inhibition Constant Data from BindingDB
Found 3 hits for monomerid = 50500011
TargetAlpha-1B adrenergic receptor(Homo sapiens (Human))
Jinan University
Curated by ChEMBL
LigandPNGBDBM50500011(CHEMBL3739533)
Affinity DataIC50:  13nM. Assay description: Antagonist activity at adrenergic alpha1B receptor (unknown origin) by firefly and renilla dual glo luciferase assay
Ligand InfoPC cidPC sid
In DepthDetails ArticlePubMed
TargetAlpha-1A adrenergic receptor(Homo sapiens (Human))
Jinan University
Curated by ChEMBL
LigandPNGBDBM50500011(CHEMBL3739533)
Affinity DataIC50:  50nM. Assay description: Antagonist activity at adrenergic alpha1A receptor (unknown origin) by firefly and renilla dual glo luciferase assay
Ligand InfoPC cidPC sid
In DepthDetails ArticlePubMed
TargetAlpha-1D adrenergic receptor(Homo sapiens (Human))
Jinan University
Curated by ChEMBL
LigandPNGBDBM50500011(CHEMBL3739533)
Affinity DataIC50:  11nM. Assay description: Antagonist activity at adrenergic alpha1D receptor (unknown origin) by firefly and renilla dual glo luciferase assay
Ligand InfoPC cidPC sid
In DepthDetails ArticlePubMed