BDBM50500614 CHEMBL3754544
SMILES COc1ccc(CCC(=O)N(C(C(=O)NC2CCCCC2)c2ccc(cc2)[N+]([O-])=O)c2ccc(Br)cc2)cc1
InChI Key InChIKey=IKTKWRDEWFJXQH-UHFFFAOYSA-N
Data  1 IC50
  Tab Delimited (TSV)   2D SDfile   Computed 3D by Vconf -m prep SDfile
Find this compound or compounds like it in BindingDB:
Activity Spreadsheet -- Enzyme Inhibition Constant Data from BindingDB
Found 1 hit for monomerid = 50500614
TargetPeptidyl-prolyl cis-trans isomerase A(Homo sapiens (Human))
Chonnam National University
Curated by ChEMBL
LigandPNGBDBM50500614(CHEMBL3754544)
Affinity DataIC50:  11nM. Assay description: Inhibition of Cyclophilin A peptidyl-prolyl cis-trans isomerase activity (unknown origin) using Succ-Ala-Leu-Pro-Phe-p-nitroaniline as substrate by I...
Ligand InfoPC cidPC sid
In DepthDetails ArticlePubMed