BDBM50500845 3-Azoniaspiro[5.5]Undecane Chloride::CHEMBL2041319
SMILES Cl.C1CCC2(CC1)CCNCC2
InChI Key InChIKey=LIZKZVQBLDHKCY-UHFFFAOYSA-N
Data  1 IC50
  Tab Delimited (TSV)   2D SDfile   Computed 3D by Vconf -m prep SDfile
Find this compound or compounds like it in BindingDB:
Activity Spreadsheet -- Enzyme Inhibition Constant Data from BindingDB
Found 1 hit for monomerid = 50500845
TargetMatrix protein 2(Influenza A virus (A/Udorn/307/1972(H3N2)))
The University Of Arizona
Curated by ChEMBL
LigandPNGBDBM50500845(3-Azoniaspiro[5.5]Undecane Chloride | CHEMBL204131...)
Affinity DataIC50:  900nM. Assay description: Inhibition of Influenza A virus wild type M2 proton channel infected in Xenopus laevis oocytes after 2 mins by TEVC assay
In DepthDetails ArticlePubMed